{"text_format":"1","workbook":"xlsx","n_sheets":10,"sheets":["Instructions","Budget Overview","Year 1","Year 2","Year 3","Year 4","(Optional) Year 5 - Evaluation","Matching","Related Outside Funding","Projects Overview"],"not_rendered":{"charts":0,"images":99,"macros":1,"external_links":0,"defined_names":4,"comments":0,"pivot_tables":0},"unopened":[],"bounds":{"document_bytes":16777216,"sheet_cells":100000,"rows_first":2000,"rows_last":500,"rows_between":2000,"halvings":0,"cell_chars":16384,"cell_head_chars":4096},"cells_cut":0,"cells_raw":0,"read":"whole","date_system":"1900"}

{"sheet":"Instructions","index":0,"n_rows":37,"n_cols":1,"rows_kept":37,"cut":false,"hidden":false,"merged":[[34,0,34,6],[36,0,36,6],[20,0,20,6],[22,0,22,6],[24,0,24,6],[26,0,26,6],[28,0,28,6],[32,0,32,6],[14,0,16,6],[0,0,0,6],[1,0,1,6],[4,0,6,6],[8,0,8,6],[10,0,12,6]]}
[]
["Digital Equity Competitive Grant Program (DECGP)\nConsolidated Budget Form\nOMB Control Number: 0660-0055   Expiration Date: 07/31/2027"]
["Consolidated Budget Form Instructions"]
["WORKSHEET INSTRUCTIONS"]
["NOTE: This document requires enabled macros to function properly. Please ensure that macros are enabled before entering any data. You may be able to enable macros by choosing the \"Enable this content\" option from the Security Warning Ribbon above.\n\nIf the ribbon is not visible you may have been prompted to enable macros when you opened the document as pictured here. If you elected to disable the macros, please close the document and reopen it with macros enabled. "]
[]
[]
["PURPOSE"]
["This form will serve as a tool to capture budget information for the Digital Equity Competitive Grant Program application. Per section IV.B.8 of the NOFO, any entity applying for the Digital Equity Competitive Grant Program must submit the Consolidated Budget Form as part of their application. \n\nApplications from Eligible Entities, including Indian Tribes, Alaska Native entities, and Native Hawaiian organizations (\"Native Entities\"), for the Digital Equity Competitive Grant Program must be received no later 11:59 p.m. ET on September 23, 2024. Applications from the United States Virgin Islands, Guam, American Samoa, the Commonwealth of the Northern Mariana Islands, and any other territory or possession of the United States (\"U.S. Territories\") must be received no later than 11:59 p.m. ET on October 22, 2024."]
["WORKSHEET NAVIGATION"]
{"$rows_left_out":28}
{"sheet":"Budget Overview","index":1,"n_rows":29,"n_cols":20,"rows_kept":29,"cut":false,"hidden":false,"merged":[[0,0,0,18],[1,0,1,18],[2,1,2,3],[2,4,2,6],[2,7,2,9],[2,10,2,12],[2,13,2,15],[2,16,2,18],[21,2,21,3],[26,2,26,3],[26,5,26,6],[16,0,16,18],[18,0,18,18],[22,2,22,3]]}
["Budget Overview"]
["NOTE: All values in rows 5-20 are locked. Any errors found should be fixed on the corresponding budget detail tab.\n\nCells B22 and B23 are not locked and should be used to specify the total expenses how much of the total proposed grant amount will be allocated towards administration and evaluation of the program. A percentage allocation will be automatically calculated, and must not exceed 10% of the total grant award (See IIJA Section 60305(d)(2)).\n\nCells B25, B26, and B27 are locked and will populate totals for matching contribution based on information input in the corresponding tabs. The percentage of the total award matched by non-federal contributions will be automatically calculated; note that statutorily at least a 10% match must be provided.  \n\nCell B29 is also locked and will populate the total additional supplementary funds based on information input in the corresponding tabs. "]
[null,"Fiscal / Project Year 1 ",null,null,"Fiscal / Project Year 2",null,null,"Fiscal / Project Year 3",null,null,"Fiscal / Project Year 4",null,null,"(Optional) Year 5 - Evaluation Period",null,null,"Totals"]
["Budget Category","Federal Request","Matching Contribution","Total","Federal Request","Matching Contribution","Total","Federal Request","Matching Contribution","Total","Federal Request","Matching Contribution","Total","Federal Request","Matching Contribution","Total","Total Federal Request","Total Matching Contribution","Total(s)"]
["A. Personnel",{"$f":"'Year 1'!$K$21","v":130200},{"$f":"'Year 1'!$J$21","v":60000},{"$f":"SUM(B5:C5)","v":190200},{"$f":"'Year 2'!$K$21","v":130200},{"$f":"'Year 2'!$J$21","v":60000},{"$f":"SUM(E5:F5)","v":190200},{"$f":"'Year 3'!$K$23","v":130200},{"$f":"'Year 3'!$J$23","v":60000},{"$f":"SUM(H5:I5)","v":190200},{"$f":"'Year 4'!$K$17","v":130200},{"$f":"'Year 4'!$J$17","v":60000},{"$f":"SUM(K5:L5)","v":190200},{"$f":"'(Optional) Year 5 - Evaluation'!$K$27","v":33500},{"$f":"'(Optional) Year 5 - Evaluation'!$J$27","v":25000},{"$f":"SUM(N5,O5)","v":58500},{"$f":"SUM(B5,E5,H5,K5,N5)","v":554300},{"$f":"SUM(C5,F5,I5,L5,O5)","v":265000},{"$f":"SUM(D5,G5,J5,M5,P5)","v":819300},{"$f":"SUM(F5,I5,L5,#REF!)","v":{"$error":"#REF!"}}]
["Salary",{"$f":"'Year 1'!$G$21","v":180000},null,{"$f":"SUM(B6:C6)","v":180000},{"$f":"'Year 2'!$G$21","v":180000},null,{"$f":"SUM(E6:F6)","v":180000},{"$f":"'Year 3'!$G$23","v":180000},null,{"$f":"SUM(H6:I6)","v":180000},{"$f":"'Year 4'!$G$17","v":180000},null,{"$f":"SUM(K6:L6)","v":180000},{"$f":"'(Optional) Year 5 - Evaluation'!$G$27","v":50000},null,{"$f":"SUM(N6,O6)","v":50000},{"$f":"SUM(B6,E6,H6,K6,N6)","v":770000},null,{"$f":"SUM(D6,G6,J6,M6,P6)","v":770000},{"$f":"SUM(F6,I6,L6,#REF!)","v":{"$error":"#REF!"}}]
["Fringe",{"$f":"'Year 1'!$H$21","v":10200},null,10200,{"$f":"'Year 2'!$H$21","v":10200},null,10200,{"$f":"'Year 3'!$H$23","v":10200},null,10200,{"$f":"'Year 4'!$H$17","v":10200},null,10200,{"$f":"'(Optional) Year 5 - Evaluation'!$H$27","v":8500},null,8500,49300,null,49300,{"$f":"SUM(F7,I7,L7,#REF!)","v":{"$error":"#REF!"}}]
["B. Travel",{"$f":"'Year 1'!$M$45","v":1883.75},{"$f":"'Year 1'!$L$45","v":3247.5},5131.25,{"$f":"'Year 2'!$M$45","v":1883.75},{"$f":"'Year 2'!$L$45","v":3247.5},5131.25,{"$f":"'Year 3'!$M$47","v":1883.75},{"$f":"'Year 3'!$L$47","v":3247.5},5131.25,{"$f":"'Year 4'!$M$41","v":1883.75},{"$f":"'Year 4'!$L$41","v":3247.5},5131.25,{"$f":"'(Optional) Year 5 - Evaluation'!$M$51","v":558},{"$f":"'(Optional) Year 5 - Evaluation'!$L$51","v":0},558,8093,{"$f":"SUM(C8,F8,I8,L8,O8)","v":12990},21083,{"$f":"SUM(F8,I8,L8,#REF!)","v":{"$error":"#REF!"}}]
["C. Equipment",{"$f":"'Year 1'!$E$69","v":12614.03},{"$f":"'Year 1'!$D$69","v":0},12614.03,{"$f":"'Year 2'!$E$69","v":0},{"$f":"'Year 2'!$D$69","v":0},0,{"$f":"'Year 3'!$E$71","v":0},{"$f":"'Year 3'!$D$71","v":0},0,{"$f":"'Year 4'!$E$64","v":0},{"$f":"'Year 4'!$D$64","v":0},0,{"$f":"'(Optional) Year 5 - Evaluation'!$E$75","v":0},{"$f":"'(Optional) Year 5 - Evaluation'!$D$75","v":0},0,12614.03,0,12614.03,{"$f":"SUM(F9,I9,L9,#REF!)","v":{"$error":"#REF!"}}]
["D. Supplies",{"$f":"'Year 1'!$E$95","v":2299.88},{"$f":"'Year 1'!$D$95","v":0},2299.88,{"$f":"'Year 2'!$E$92","v":299.89999999999998},{"$f":"'Year 2'!$D$92","v":0},299.89999999999998,{"$f":"'Year 3'!$E$94","v":299.89999999999998},{"$f":"'Year 3'!$D$94","v":0},299.89999999999998,{"$f":"'Year 4'!$E$88","v":299.89999999999998},{"$f":"'Year 4'!$D$88","v":0},299.89999999999998,{"$f":"'(Optional) Year 5 - Evaluation'!$E$99","v":0},{"$f":"'(Optional) Year 5 - Evaluation'!$D$99","v":0},0,3199.5800000000004,0,3199.5800000000004,{"$f":"SUM(F10,I10,L10,#REF!)","v":{"$error":"#REF!"}}]
{"$rows_left_out":20}
{"sheet":"Year 1","index":2,"n_rows":220,"n_cols":17,"rows_kept":220,"cut":false,"hidden":false,"merged":[[4,3,4,11],[219,0,220,16],[74,2,74,6],[195,0,196,16],[171,0,172,16],[147,0,148,16],[96,0,97,16],[175,1,175,5],[199,2,199,7],[50,2,50,6],[22,0,23,16],[46,0,47,16],[70,0,71,16],[26,3,26,15],[124,0,124,16]]}
["Budget Detail - Year 1"]
[]
[]
["A. Personnel"]
[]
["Position Title","Key Personnel","Relevant Specific Project(s)","Level of Effort ","Unit","Unit Cost","Subtotal Salary","Fringe Benefits","Fringe Rate","Matching Contribution","Federal Request","Total ","Column2","Column3","Column4","Column5","Column6"]
["Grant Manager","Yes","Project A",1,"Annual",60000,{"$f":"D7*F7","v":60000},{"$f":"Table1[[#This Row],[Subtotal Salary]]*Table1[[#This Row],[Fringe Rate]]","v":10200},0.17,0,{"$f":"G7+H7-J7","v":70200},{"$f":"J7+K7","v":70200}]
["Legal Staff","No",null,400,"Hour",300,{"$f":"D8*F8","v":120000},{"$f":"Table1[[#This Row],[Subtotal Salary]]*Table1[[#This Row],[Fringe Rate]]","v":0},0,60000,60000,120000]
[null,null,null,null,null,null,0,{"$f":"Table1[[#This Row],[Subtotal Salary]]*Table1[[#This Row],[Fringe Rate]]","v":0},null,null,0,0]
[null,null,null,null,null,null,0,{"$f":"Table1[[#This Row],[Subtotal Salary]]*Table1[[#This Row],[Fringe Rate]]","v":0},null,null,0,0]
{"$rows_left_out":211}
{"sheet":"Year 2","index":3,"n_rows":219,"n_cols":17,"rows_kept":219,"cut":false,"hidden":false,"merged":[[198,2,198,7],[218,0,219,16],[4,3,4,11],[74,2,74,6],[93,0,94,16],[146,0,147,16],[170,0,171,16],[174,1,174,5],[194,0,195,16],[22,0,23,16],[26,3,26,15],[46,0,47,16],[50,2,50,6],[70,0,71,16],[122,0,122,16],[143,0,144,16]]}
["Budget Detail - Year 2"]
[]
[]
["A. Personnel"]
[]
["Position Title","Key Personnel","Relevant Specific Project(s)","Level of Effort ","Unit","Unit Cost","Subtotal Salary","Fringe Benefits","Fringe Rate","Matching Contribution","Federal Request","Total ","Column2","Column3","Column4","Column5","Column6"]
["Grant Manager","Yes","Project A",1,"Annual",60000,60000,10200,0.17,0,70200,70200]
["Legal Staff","No",null,400,"Hour",300,120000,0,0,60000,60000,120000]
[null,null,null,null,null,null,{"$f":"D9*F9","v":0},{"$f":"Table16[[#This Row],[Subtotal Salary]]*Table16[[#This Row],[Fringe Rate]]","v":0},null,null,{"$f":"G9+H9-J9","v":0},{"$f":"J9+K9","v":0}]
[null,null,null,null,null,null,0,{"$f":"Table16[[#This Row],[Subtotal Salary]]*Table16[[#This Row],[Fringe Rate]]","v":0},null,null,0,0]
{"$rows_left_out":210}
{"sheet":"Year 3","index":4,"n_rows":215,"n_cols":17,"rows_kept":215,"cut":false,"hidden":false,"merged":[[194,2,194,7],[214,0,215,16],[4,3,4,11],[76,2,76,6],[95,0,96,16],[142,0,143,16],[166,0,167,16],[170,1,170,5],[190,0,191,16],[24,0,25,16],[28,3,28,15],[48,0,49,16],[52,2,52,6],[72,0,73,16],[120,0,120,16]]}
["Budget Detail - Year 3"]
[]
[]
["A. Personnel"]
[]
["Position Title","Key Personnel","Relevant Specific Project(s)","Level of Effort ","Unit","Unit Cost","Subtotal Salary","Fringe Benefits","Fringe Rate","Matching Contribution","Federal Request","Total ","Column2","Column3","Column4","Column5","Column6"]
["Grant Manager","Yes","Project A",1,"Annual",60000,60000,10200,0.17,0,70200,70200]
["Legal Staff","No",null,400,"Hour",300,120000,0,0,60000,60000,120000]
[null,null,null,null,null,null,{"$f":"D9*F9","v":0},{"$f":"Table1620[[#This Row],[Subtotal Salary]]*Table1620[[#This Row],[Fringe Rate]]","v":0},null,null,{"$f":"G9+H9-J9","v":0},{"$f":"J9+K9","v":0}]
[null,null,null,null,null,null,0,{"$f":"Table1620[[#This Row],[Subtotal Salary]]*Table1620[[#This Row],[Fringe Rate]]","v":0},null,null,0,0]
{"$rows_left_out":206}
{"sheet":"Year 4","index":5,"n_rows":210,"n_cols":17,"rows_kept":210,"cut":false,"hidden":false,"merged":[[189,2,189,7],[209,0,210,16],[4,3,4,11],[69,2,69,6],[89,0,90,16],[137,0,138,16],[161,0,162,16],[165,1,165,5],[185,0,186,16],[18,0,19,16],[22,3,22,15],[42,0,43,16],[46,2,46,6],[65,0,66,16]]}
["Budget Detail - Year 4"]
[]
[]
["A. Personnel"]
[]
["Position Title","Key Personnel","Relevant Specific Project(s)","Level of Effort","Unit","Unit Cost","Subtotal Salary","Fringe Benefits","Fringe Rate","Matching Contribution","Federal Request","Total ","Column2","Column3","Column4","Column5","Column6"]
["Grant Manager","Yes","Project A",1,"Annual",60000,60000,10200,0.17,0,70200,70200]
["Legal Staff","No",null,400,"Hour",300,120000,0,0,60000,60000,120000]
[null,null,null,null,null,null,{"$f":"D9*F9","v":0},{"$f":"Table129[[#This Row],[Subtotal Salary]]*Table129[[#This Row],[Fringe Rate]]","v":0},null,null,{"$f":"G9+H9-J9","v":0},{"$f":"J9+K9","v":0}]
[null,null,null,null,null,null,0,{"$f":"Table129[[#This Row],[Subtotal Salary]]*Table129[[#This Row],[Fringe Rate]]","v":0},null,null,0,0]
{"$rows_left_out":201}
{"sheet":"(Optional) Year 5 - Evaluation","index":6,"n_rows":221,"n_cols":17,"rows_kept":221,"cut":false,"hidden":false,"merged":[[76,0,77,16],[4,3,4,11],[28,0,29,16],[32,3,32,15],[52,0,53,16],[56,2,56,6],[201,2,201,7],[221,0,222,16],[80,2,80,6],[100,0,101,16],[148,0,149,16],[173,0,174,16],[177,1,177,5],[197,0,198,16],[124,0,124,16]]}
["Budget Detail - (Optional) Year 5 - Evaluation Period"]
[]
[]
["A. Personnel"]
[]
["Position Title","Key Personnel","Relevant Specific Project(s)","Level of Effort","Unit","Unit Cost","Subtotal Salary","Fringe Benefits","Fringe Rate","Matching Contribution","Federal Request","Total ","Column2","Column3","Column4","Column5","Column6"]
["Grant Manager","Yes","Project A, Project B, Project C",1,"Annual",50000,{"$f":"D7*F7","v":50000},{"$f":"Table12941[[#This Row],[Subtotal Salary]]*Table12941[[#This Row],[Fringe Rate]]","v":8500},0.17,25000,{"$f":"G7+H7-J7","v":33500},{"$f":"J7+K7","v":58500}]
[null,null,null,null,null,null,{"$f":"D8*F8","v":0},{"$f":"Table12941[[#This Row],[Subtotal Salary]]*Table12941[[#This Row],[Fringe Rate]]","v":0},null,null,0,0]
[null,null,null,null,null,null,0,{"$f":"Table12941[[#This Row],[Subtotal Salary]]*Table12941[[#This Row],[Fringe Rate]]","v":0},null,null,0,0]
[null,null,null,null,null,null,0,{"$f":"Table12941[[#This Row],[Subtotal Salary]]*Table12941[[#This Row],[Fringe Rate]]","v":0},null,null,0,0]
{"$rows_left_out":212}
{"sheet":"Matching","index":7,"n_rows":14,"n_cols":6,"rows_kept":14,"cut":false,"hidden":false,"merged":[[14,0,15,5],[1,0,1,5]]}
["Matching"]
["Record the cash or cash value of any intended instances of matching proposed by the eligible entity or by third party contributors in the table below. Please do NOT enter any matching funding provided by a subrecipient on this tab. All matching funding provided by a subrecipient should be entered within the \"SUBRECIPIENTS\" section on the Years 1-4 and (Optional) Year 5 - Evaluation tabs."]
[]
["Organization/Source","Type","Cost Share Item/Description (Required for In-Kind Match) \nE.g., use of a facility, providing tablets to be used in Project A, etc.","Source Type","Value","Share Value of Total Award Cost"]
["Applicant","Cash","N/A","Local",291990,{"$f":"IFERROR(Table37[[#This Row],[Value]]/('Budget Overview'!$S$20),0)","v":2.7434331147426883E-2}]
[null,null,null,null,null,{"$f":"IFERROR(Table37[[#This Row],[Value]]/('Budget Overview'!$S$20),0)","v":0}]
[null,null,null,null,null,{"$f":"IFERROR(Table37[[#This Row],[Value]]/('Budget Overview'!$S$20),0)","v":0}]
[null,null,null,null,null,{"$f":"IFERROR(Table37[[#This Row],[Value]]/('Budget Overview'!$S$20),0)","v":0}]
[null,null,null,null,null,{"$f":"IFERROR(Table37[[#This Row],[Value]]/('Budget Overview'!$S$20),0)","v":0}]
[null,null,null,null,null,{"$f":"IFERROR(Table37[[#This Row],[Value]]/('Budget Overview'!$S$20),0)","v":0}]
{"$rows_left_out":5}
{"sheet":"Related Outside Funding","index":8,"n_rows":12,"n_cols":5,"rows_kept":12,"cut":false,"hidden":false,"merged":[[1,0,1,4],[11,0,12,4]]}
["Related Outside Funding"]
["Record the source and amount of other Federal, State, or outside funding sources the entity receives, or has applied for, that fund the activities or projects to which the application relates. This includes any funding requests through the Digital Equity Capacity Grant Program, the Tribal Broadband Connectivity Program (TBCP), and the Broadband Equity Access and Deployment (BEAD) Program. Please see Section IV B (15) of the DE Competitive NOFO for more information."]
[]
["Organization/Source","Funding Description","Source Type","Received / Anticipated (i.e., applied for)","Amount"]
["National Telecommunications and Information Administration","Applied to be a subrecipient of the State Digital Equity Capacity Grant Program in X state.","Federal","Anticipated",500000]
[]
[]
[]
[]
["TOTAL RELATED OUTSIDE FUNDING",null,null,null,{"$f":"SUM(Table39[Amount])","v":500000}]
{"$rows_left_out":3}
{"sheet":"Projects Overview","index":9,"n_rows":22,"n_cols":16,"rows_kept":22,"cut":false,"hidden":false,"merged":[[1,0,1,15],[3,19,3,25],[3,3,3,5],[3,6,3,8],[3,9,3,11],[3,12,3,14]]}
["Projects Overview"]
["List all of the projects included in your application (i.e., the discrete activities/interventions to be implemented) below, and provide budget information that will be allocated to that project for each project year. Note that the information on this tab is not calculated based on other entries and must be manually input below. The Total Amount Allocated is the total amount of funding designated for the specific project in each Project Year. The Amount to be Subgranted is the amount of funding designated for the specific project that will be subgranted for each Project Year. The Total Amount to be Implemented Directly is the total amount of funding the eligible entity intends to implement without subgranted funds designated for the specific project for each Project Year."]
[]
[null,null,null,"Project Year 1",null,null,"Project Year 2",null,null,"Project Year 3",null,null,"Project Year 4",null,null,"TOTAL"]
["Project Name","Project ID","Brief Project Description","Total Amount Allocated","Amount to be Subgranted","Amount to be Implemented Directly","Total Amount Allocated ","Amount to be Subgranted ","Amount to be Implemented Directly "," Total Amount Allocated"," Amount to be Subgranted"," Amount to be Implemented Directly"," Total Amount Allocated "," Amount to be Subgranted "," Amount to be Implemented Directly "," Total Amount Allocated  "]
["Project A","LeadApplicant-01","Narrative",814609.4,0,814609.4,803476.25,0,803476.25,303476.25,0,303476.25,153476.25,0,153476.25,{"$f":"SUM(D6,G6,J6,M6)","v":2075038.15}]
["Project B",null,null,850000,850000,0,850000,850000,0,550000,550000,null,550000,550000,null,2800000]
["Project C",null,null,1250000,850000,400000,1250000,850000,400000,1250000,850000,400000,1250000,850000,400000,5000000]
[null,null,null,null,null,null,null,null,null,null,null,null,null,null,null,0]
[null,null,null,null,null,null,null,null,null,null,null,null,null,null,null,0]
{"$rows_left_out":12}